Target
Voltage-dependent T-type calcium channel subunit alpha-1H
Ligand
BDBM78446
Substrate
Meas. Tech.
Inhibitors of T-Type Calcium Channels (SynthLib1)
EC50
3700±n/a nM
Citation
 PubChem, PC Inhibitors of T-Type Calcium Channels (SynthLib1) PubChem Bioassay (2011)[AID] 
Target
Name:
Voltage-dependent T-type calcium channel subunit alpha-1H
Synonyms:
CAC1H_HUMAN Low-voltage-activated calcium channel alpha1 3.2 subunit Voltage-gated calcium channel voltage-dependent T-type calcium channel subunit alpha-1H isoform a
Type:
Enzyme Catalytic Domain
Mol. Mass.:
259187.68
Organism:
Homo sapiens (Human)
Description:
Calcium channel (Type T,L) 0 0::O95180
Residue:
2353
  
Inhibitor
Name:
BDBM78446
Synonyms:
N-[5-(3,4-difluorophenyl)-1,3,4-oxadiazol-2-yl]-2-(4-fluorophenoxy)acetamide VU0405167-1 | cid_44251480
Type:
Small organic molecule
Emp. Form.:
C16H10F3N3O3
Mol. Mass.:
349.2641
SMILES:
Fc1ccc(OCC(=O)Nc2nnc(o2)-c2ccc(F)c(F)c2)cc1
: