Target
Voltage-dependent T-type calcium channel subunit alpha-1H
Ligand
BDBM78468
Substrate
Meas. Tech.
Inhibitors of T-Type Calcium Channels (SynthLib1)
EC50
10000±n/a nM
Citation
 PubChem, PC Inhibitors of T-Type Calcium Channels (SynthLib1) PubChem Bioassay (2011)[AID] 
Target
Name:
Voltage-dependent T-type calcium channel subunit alpha-1H
Synonyms:
CAC1H_HUMAN Low-voltage-activated calcium channel alpha1 3.2 subunit Voltage-gated calcium channel voltage-dependent T-type calcium channel subunit alpha-1H isoform a
Type:
Enzyme Catalytic Domain
Mol. Mass.:
259187.68
Organism:
Homo sapiens (Human)
Description:
Calcium channel (Type T,L) 0 0::O95180
Residue:
2353
  
Inhibitor
Name:
BDBM78468
Synonyms:
N-[5-(2,3-dihydro-1,4-benzodioxin-6-yl)-1,3,4-oxadiazol-2-yl]-2-(2-fluoranylphenoxy)ethanamide VU0405189-1 | cid_44251500
Type:
Small organic molecule
Emp. Form.:
C18H14FN3O5
Mol. Mass.:
371.3193
SMILES:
Fc1ccccc1OCC(=O)Nc1nnc(o1)-c1ccc2OCCOc2c1
: