Target
Voltage-dependent T-type calcium channel subunit alpha-1H
Ligand
BDBM78483
Substrate
Meas. Tech.
Inhibitors of T-Type Calcium Channels (SynthLib1)
EC50
4600±n/a nM
Citation
 PubChem, PC Inhibitors of T-Type Calcium Channels (SynthLib1) PubChem Bioassay (2011)[AID] 
Target
Name:
Voltage-dependent T-type calcium channel subunit alpha-1H
Synonyms:
CAC1H_HUMAN Low-voltage-activated calcium channel alpha1 3.2 subunit Voltage-gated calcium channel voltage-dependent T-type calcium channel subunit alpha-1H isoform a
Type:
Enzyme Catalytic Domain
Mol. Mass.:
259187.68
Organism:
Homo sapiens (Human)
Description:
Calcium channel (Type T,L) 0 0::O95180
Residue:
2353
  
Inhibitor
Name:
BDBM78483
Synonyms:
2-(2-chloranylphenoxy)-N-[5-(4-fluorophenyl)-1,3,4-oxadiazol-2-yl]ethanamide VU0405410-1 | cid_44263508
Type:
Small organic molecule
Emp. Form.:
C16H11ClFN3O3
Mol. Mass.:
347.728
SMILES:
Fc1ccc(cc1)-c1nnc(NC(=O)COc2ccccc2Cl)o1
: