Target
Ubiquitin-conjugating enzyme E2 N
Ligand
BDBM66590
Substrate
Meas. Tech.
Dose Response confirmation of uHTS for the identification of UBC13 Polyubiquitin Inhibitors via a TR-FRET Assay
IC50
829±64 nM
Citation
 PubChem, PC Dose Response confirmation of uHTS for the identification of UBC13 Polyubiquitin Inhibitors via a TR-FRET Assay PubChem Bioassay (2011)[AID] 
Target
Name:
Ubiquitin-conjugating enzyme E2 N
Synonyms:
BLU UBE2N_HUMAN | ubiquitin-conjugating enzyme E2 N
Type:
PROTEIN
Mol. Mass.:
17137.61
Organism:
Homo sapiens (Human)
Description:
EBI_101440
Residue:
152
  
Inhibitor
Name:
BDBM66590
Synonyms:
MLS000660952 N-[2-(4-phenylpiperazin-1-yl)ethyl]-6-sulfanylidene-5H-benzimidazolo[1,2-c]quinazoline-3-carboxamide N-[2-(4-phenylpiperazino)ethyl]-6-thioxo-5H-benzimidazolo[1,2-c]quinazoline-3-carboxamide cid_16195584
Type:
Small organic molecule
Emp. Form.:
C27H26N6OS
Mol. Mass.:
482.6
SMILES:
O=C(NCCN1CCN(CC1)c1ccccc1)c1ccc2c3nc4ccccc4n3c(=S)[nH]c2c1
: