Target
Ubiquitin-conjugating enzyme E2 N
Ligand
BDBM75443
Substrate
Meas. Tech.
Dose Response confirmation of uHTS for the identification of UBC13 Polyubiquitin Inhibitors via a TR-FRET Assay
IC50
>20000±0 nM
Citation
 PubChem, PC Dose Response confirmation of uHTS for the identification of UBC13 Polyubiquitin Inhibitors via a TR-FRET Assay PubChem Bioassay (2011)[AID] 
Target
Name:
Ubiquitin-conjugating enzyme E2 N
Synonyms:
BLU UBE2N_HUMAN | ubiquitin-conjugating enzyme E2 N
Type:
PROTEIN
Mol. Mass.:
17137.61
Organism:
Homo sapiens (Human)
Description:
EBI_101440
Residue:
152
  
Inhibitor
Name:
BDBM75443
Synonyms:
2-[4-[2-(4-methoxyphenyl)-1-benzothiophen-3-yl]phenoxy]-N,N-dimethyl-ethanamine 2-[4-[2-(4-methoxyphenyl)benzothiophen-3-yl]phenoxy]ethyl-dimethyl-amine MLS002473632 cid_44202275
Type:
Small organic molecule
Emp. Form.:
C25H25NO2S
Mol. Mass.:
403.537
SMILES:
COc1ccc(cc1)-c1sc2ccccc2c1-c1ccc(OCCN(C)C)cc1
: