Target
Ubiquitin-conjugating enzyme E2 N
Ligand
BDBM79040
Substrate
Meas. Tech.
Dose Response confirmation of uHTS for the identification of UBC13 Polyubiquitin Inhibitors via a TR-FRET Assay reconfirm
IC50
1885±46 nM
Citation
 PubChem, PC Dose Response confirmation of uHTS for the identification of UBC13 Polyubiquitin Inhibitors via a TR-FRET Assay reconfirm PubChem Bioassay (2011)[AID] 
Target
Name:
Ubiquitin-conjugating enzyme E2 N
Synonyms:
BLU UBE2N_HUMAN | ubiquitin-conjugating enzyme E2 N
Type:
PROTEIN
Mol. Mass.:
17137.61
Organism:
Homo sapiens (Human)
Description:
EBI_101440
Residue:
152
  
Inhibitor
Name:
BDBM79040
Synonyms:
MLS001029195 N-[[1-[(3-chlorophenyl)methyl]-4-piperidinyl]methyl]-1-(7,8,9,10-tetrahydro-6H-purino[9,8-a]azepin-4-yl)-3-piperidinecarboxamide SMR000629117 | cid_20912362
Type:
Small organic molecule
Emp. Form.:
C29H38ClN7O
Mol. Mass.:
536.111
SMILES:
Clc1cccc(CN2CCC(CNC(=O)C3CCCN(C3)c3ncnc4n5CCCCCc5nc34)CC2)c1
: