Target
X-box-binding protein 1
Ligand
BDBM31051
Substrate
Meas. Tech.
XBP1 DR counterscreen for CHOP
IC50
5220±n/a nM
Citation
 PubChem, PC XBP1 DR counterscreen for CHOP PubChem Bioassay (2011)[AID] 
Target
Name:
X-box-binding protein 1
Synonyms:
TREB5 XBP1_HUMAN | XBP2
Type:
Enzyme Catalytic Domain
Mol. Mass.:
28704.14
Organism:
Homo sapiens (Human)
Description:
gi_47678753
Residue:
261
  
Inhibitor
Name:
BDBM31051
Synonyms:
4-[4-(3-methoxyphenyl)-3-methyl-1-piperazinyl]-5H-pyrimido[5,4-b]indole 4-[4-(3-methoxyphenyl)-3-methyl-piperazino]-5H-pyrimid[5,4-b]indole MLS000078378 cid_659735
Type:
Small organic molecule
Emp. Form.:
C22H23N5O
Mol. Mass.:
373.4509
SMILES:
COc1cccc(c1)N1CCN(CC1C)c1ncnc2c1[nH]c1ccccc21
: