Target
X-box-binding protein 1
Ligand
BDBM31347
Substrate
Meas. Tech.
XBP1 DR counterscreen for CHOP
IC50
6630±n/a nM
Citation
 PubChem, PC XBP1 DR counterscreen for CHOP PubChem Bioassay (2011)[AID] 
Target
Name:
X-box-binding protein 1
Synonyms:
TREB5 XBP1_HUMAN | XBP2
Type:
Enzyme Catalytic Domain
Mol. Mass.:
28704.14
Organism:
Homo sapiens (Human)
Description:
gi_47678753
Residue:
261
  
Inhibitor
Name:
BDBM31347
Synonyms:
2-(3,4-dimethoxyphenyl)-N-[3-[5-(3-methylphenyl)-1,3,4-oxadiazol-2-yl]phenyl]acetamide 2-(3,4-dimethoxyphenyl)-N-[3-[5-(m-tolyl)-1,3,4-oxadiazol-2-yl]phenyl]acetamide MLS000052465 cid_2233014
Type:
Small organic molecule
Emp. Form.:
C25H23N3O4
Mol. Mass.:
429.4678
SMILES:
COc1ccc(CC(=O)Nc2cccc(c2)-c2nnc(o2)-c2cccc(C)c2)cc1OC
: