Target
Perilipin-5
Ligand
BDBM79410
Substrate
Meas. Tech.
Luminescence-based biochemical high throughput dose response assay for inhibitors of the interaction of the lipase co-activator protein, abhydrolase domain
IC50
3942±n/a nM
Citation
 PubChem, PC Luminescence-based biochemical high throughput dose response assay for inhibitors of the interaction of the lipase co-activator protein, abhydrolase domain containing 5 (ABHD5) with perilipin-5 (MLDP; PLIN5) (2K validation set) PubChem Bioassay (2011)[AID] 
Target
Name:
Perilipin-5
Synonyms:
LSDP5 PAT-1 PLIN5_HUMAN
Type:
Enzyme Catalytic Domain
Mol. Mass.:
50774.20
Organism:
Homo sapiens (Human)
Description:
gi_116292172
Residue:
463
  
Inhibitor
Name:
BDBM79410
Synonyms:
2-(tert-butoxycarbonylamino)-4-(methylthio)butyric acid [3-(2,3-dihydro-1,4-benzodioxin-6-yl)-4-keto-chromen-7-yl] ester 3-(2,3-dihydro-1,4-benzodioxin-6-yl)-4-oxo-4H-chromen-7-yl N-(tert-butoxycarbonyl)methioninate SMR000184538 [3-(2,3-dihydro-1,4-benzodioxin-6-yl)-4-oxochromen-7-yl] 2-[(2-methylpropan-2-yl)oxycarbonylamino]-4-methylsulfanylbutanoate | cid_2830454
Type:
Small organic molecule
Emp. Form.:
C27H29NO8S
Mol. Mass.:
527.586
SMILES:
CSCCC(NC(=O)OC(C)(C)C)C(=O)Oc1ccc2c(c1)occ(-c1ccc3OCCOc3c1)c2=O
: