Target
Perilipin-5
Ligand
BDBM79417
Substrate
Meas. Tech.
Luminescence-based biochemical high throughput dose response assay for inhibitors of the interaction of the lipase co-activator protein, abhydrolase domain
IC50
15997±n/a nM
Citation
 PubChem, PC Luminescence-based biochemical high throughput dose response assay for inhibitors of the interaction of the lipase co-activator protein, abhydrolase domain containing 5 (ABHD5) with perilipin-5 (MLDP; PLIN5) (2K validation set) PubChem Bioassay (2011)[AID] 
Target
Name:
Perilipin-5
Synonyms:
LSDP5 PAT-1 PLIN5_HUMAN
Type:
Enzyme Catalytic Domain
Mol. Mass.:
50774.20
Organism:
Homo sapiens (Human)
Description:
gi_116292172
Residue:
463
  
Inhibitor
Name:
BDBM79417
Synonyms:
2-[(5Z)-5-(3-bromobenzylidene)-4-keto-2-thioxo-thiazolidin-3-yl]-N-(3-pyridyl)acetamide 2-[(5Z)-5-[(3-bromophenyl)methylidene]-4-oxo-2-sulfanylidene-1,3-thiazolidin-3-yl]-N-pyridin-3-ylacetamide 2-[5-(3-bromobenzylidene)-4-oxo-2-thioxo-1,3-thiazolidin-3-yl]-N-3-pyridinylacetamide SMR000268326 | cid_1371626
Type:
Small organic molecule
Emp. Form.:
C17H12BrN3O2S2
Mol. Mass.:
434.33
SMILES:
Brc1cccc(\C=C2/SC(=S)N(CC(=O)Nc3cccnc3)C2=O)c1
: