Target
Perilipin-5
Ligand
BDBM34233
Substrate
Meas. Tech.
Luminescence-based biochemical high throughput dose response assay for inhibitors of the interaction of the lipase co-activator protein, abhydrolase domain
IC50
1101±n/a nM
Citation
 PubChem, PC Luminescence-based biochemical high throughput dose response assay for inhibitors of the interaction of the lipase co-activator protein, abhydrolase domain containing 5 (ABHD5) with perilipin-5 (MLDP; PLIN5) (2K validation set) PubChem Bioassay (2011)[AID] 
Target
Name:
Perilipin-5
Synonyms:
LSDP5 PAT-1 PLIN5_HUMAN
Type:
Enzyme Catalytic Domain
Mol. Mass.:
50774.20
Organism:
Homo sapiens (Human)
Description:
gi_116292172
Residue:
463
  
Inhibitor
Name:
BDBM34233
Synonyms:
2-Phenyl-benzo[d]isoselenazol-3-one 2-phenyl-1,2-benzisoselazol-3(2H)-one 2-phenylbenzo[d][1,2]selenazol-3(2H)-one EBSELEN MLS000028488 cid_3194 | med.21724, Compound 153
Type:
Small organic molecule
Emp. Form.:
C13H9NOSe
Mol. Mass.:
274.18
SMILES:
O=c1n([se]c2ccccc12)-c1ccccc1
: