Target
DNA damage-inducible transcript 3 protein
Ligand
BDBM67717
Substrate
Meas. Tech.
CHOP dose-response primary assay
IC50
<160±n/a nM
Citation
 PubChem, PC CHOP dose-response primary assay PubChem Bioassay (2011)[AID] 
Target
Name:
DNA damage-inducible transcript 3 protein
Synonyms:
Chop DDIT3_MOUSE Gadd153
Type:
Enzyme Catalytic Domain
Mol. Mass.:
19175.17
Organism:
Mus musculus
Description:
gi_160707929
Residue:
168
  
Inhibitor
Name:
BDBM67717
Synonyms:
8-[(4-chlorobenzyl)thio]-7-isoamyl-3-methyl-xanthine 8-[(4-chlorophenyl)methylthio]-3-methyl-7-(3-methylbutyl)purine-2,6-dione SMR000057707 | cid_658140
Type:
Small organic molecule
Emp. Form.:
C18H21ClN4O2S
Mol. Mass.:
392.903
SMILES:
CC(C)CCn1c(SCc2ccc(Cl)cc2)nc2n(C)c(=O)[nH]c(=O)c12
: