Target
DNA damage-inducible transcript 3 protein
Ligand
BDBM68171
Substrate
Meas. Tech.
CHOP dose-response primary assay
IC50
4730±n/a nM
Citation
 PubChem, PC CHOP dose-response primary assay PubChem Bioassay (2011)[AID] 
Target
Name:
DNA damage-inducible transcript 3 protein
Synonyms:
Chop DDIT3_MOUSE Gadd153
Type:
Enzyme Catalytic Domain
Mol. Mass.:
19175.17
Organism:
Mus musculus
Description:
gi_160707929
Residue:
168
  
Inhibitor
Name:
BDBM68171
Synonyms:
1-amyl-N-(1H-benzimidazol-2-yl)-2-hydroxy-4-keto-quinoline-3-carboxamide MLS001047329 N-(1H-benzimidazol-2-yl)-2-hydroxy-4-oxo-1-pentylquinoline-3-carboxamide SMR000427412 | cid_1935806
Type:
Small organic molecule
Emp. Form.:
C22H22N4O3
Mol. Mass.:
390.4351
SMILES:
CCCCCn1c2ccccc2c(O)c(C(=O)Nc2nc3ccccc3[nH]2)c1=O
: