Target
Gag-Pol polyprotein [588-1027]/[588-1147]
Ligand
BDBM2860
Substrate
(rC)n.(dG)12-18
Meas. Tech.
HIV-1 RT Assay
pH
7.8±n/a
Temperature
310.15±n/a K
IC50
4±n/a nM
Citation
 Hogberg, MSahlberg, CEngelhardt, PNoreen, RKangasmetsa, JJohansson, NGOberg, BVrang, LZhang, HSahlberg, BLUnge, TLovgren, SFridborg, KBackbro, K Urea-PETT compounds as a new class of HIV-1 reverse transcriptase inhibitors. 3. Synthesis and further structure-activity relationship studies of PETT analogues. J Med Chem 42:4150-60 (1999)  
Target
Name:
Gag-Pol polyprotein [588-1027]/[588-1147]
Synonyms:
EC: 2.7.7.49 | HIV-1 Reverse Transcriptase
Type:
Protein Complex
Mol. Mass.:
115684
Description:
Components:
This complex has 2 components.
Component 1
Name:
Gag-Pol polyprotein [588-1147]
Synonyms:
HIV-1 Reverse Transcriptase Chain A gag-pol
Type:
Enzyme Subunit
Mol. Mass.:
64486.41
Organism:
Human immunodeficiency virus type 1
Description:
P04585[588-1147]
Residue:
560
  
Component 2
Name:
Gag-Pol polyprotein [588-1027]
Synonyms:
HIV-1 Reverse Transcriptase Chain B gag-pol
Type:
Enzyme Subunit
Mol. Mass.:
51337.13
Organism:
Human immunodeficiency virus type 1
Description:
P04585[588-1027]
Residue:
440
  
Inhibitor
Name:
BDBM2860
Synonyms:
1-(5-bromopyridin-2-yl)-3-[2-(2-chloro-3-ethoxy-6-fluorophenyl)ethyl]urea PETT deriv. 10
Type:
Small organic molecule
Emp. Form.:
C16H16BrClFN3O2
Mol. Mass.:
416.673
SMILES:
CCOc1ccc(F)c(CCNC(=O)Nc2ccc(Br)cn2)c1Cl
:
Substrate
Name:
(rC)n.(dG)12-18
Synonyms:
Type:
RNA-DNA duplex
Mol. Mass.:
358.43
Organism:
Description:
The incorporation of Tritium-labeled dGTP onto a poly(rC):oligo(dG)template:primer.
Residue:
3
NA