Target
Gag-Pol polyprotein [588-1027,K690N]/[588-1147,K690N]
Ligand
BDBM2716
Substrate
(rC)n.(dG)12-18
Meas. Tech.
HIV-1 RT Assay
pH
7.8±n/a
Temperature
310.15±n/a K
IC50
>2500±n/a nM
Citation
 Hogberg, MSahlberg, CEngelhardt, PNoreen, RKangasmetsa, JJohansson, NGOberg, BVrang, LZhang, HSahlberg, BLUnge, TLovgren, SFridborg, KBackbro, K Urea-PETT compounds as a new class of HIV-1 reverse transcriptase inhibitors. 3. Synthesis and further structure-activity relationship studies of PETT analogues. J Med Chem 42:4150-60 (1999)  
Target
Name:
Gag-Pol polyprotein [588-1027,K690N]/[588-1147,K690N]
Synonyms:
EC: 2.7.7.49 | HIV-1 Reverse Transcriptase Mutant (K103N)
Type:
Protein Complex
Mol. Mass.:
Description:
Components:
This complex has 2 components.
Component 1
Name:
Gag-Pol polyprotein [588-1147,K690N]
Synonyms:
HIV-1 Reverse Transcriptase Mutant (K103N) Chain A gag-pol
Type:
Enzyme Subunit
Mol. Mass.:
64471.33
Organism:
Human immunodeficiency virus type 1
Description:
P04585[588-1147,K690N]
Residue:
560
  
Component 2
Name:
Gag-Pol polyprotein [588-1027,K690N]
Synonyms:
HIV-1 Reverse Transcriptase Mutant (K103N) Chain B gag-pol
Type:
Enzyme Subunit
Mol. Mass.:
51280.01
Organism:
Human immunodeficiency virus type 1
Description:
P04585[588-1027,K690N]
Residue:
440
  
Inhibitor
Name:
BDBM2716
Synonyms:
1-(5-bromopyridin-2-yl)-3-{2-[3-(dimethylamino)-2,6-difluorophenyl]ethyl}urea N-[2-(2,6-Difluoro-3-(dimethylamino)phenethyl)]-N-[2-(5-bromopyridyl)]urea | urea-PETT deriv. 1
Type:
Small organic molecule
Emp. Form.:
C16H17BrF2N4O
Mol. Mass.:
399.233
SMILES:
CN(C)c1ccc(F)c(CCNC(=O)Nc2ccc(Br)cn2)c1F
:
Substrate
Name:
(rC)n.(dG)12-18
Synonyms:
Type:
RNA-DNA duplex
Mol. Mass.:
358.43
Organism:
Description:
The incorporation of Tritium-labeled dGTP onto a poly(rC):oligo(dG)template:primer.
Residue:
3
NA