Target
Peroxisome proliferator-activated receptor gamma
Ligand
BDBM79448
Substrate
Meas. Tech.
TR-FRET-based biochemical dose response competitive binding lanthascreen assay for partial agonists of the peroxisome proliferator-activated receptor gamma (PPARg)
IC50
2500±n/a nM
Citation
 PubChem, PC TR-FRET-based biochemical dose response competitive binding lanthascreen assay for partial agonists of the peroxisome proliferator-activated receptor gamma (PPARg) PubChem Bioassay (2011)[AID] 
Target
Name:
Peroxisome proliferator-activated receptor gamma
Synonyms:
NR1C3 PPAR-gamma PPARG_HUMAN Peroxisome proliferator-activated receptor gamma (PPAR gamma) Peroxisome proliferator-activated receptor gamma (PPARĪ³) peroxisome proliferator-activated receptor gamma isoform 2
Type:
Nuclear Receptor
Mol. Mass.:
57613.46
Organism:
Homo sapiens (Human)
Description:
P37231
Residue:
505
  
Inhibitor
Name:
BDBM79448
Synonyms:
3-[(5Z)-5-(2,4-difluorobenzylidene)-4-keto-2-thioxo-thiazolidin-3-yl]propionic acid 3-[(5Z)-5-[(2,4-difluorophenyl)methylidene]-4-oxo-2-sulfanylidene-3-thiazolidinyl]propanoic acid SR-03000001970 cid_49835913
Type:
Small organic molecule
Emp. Form.:
C13H9F2NO3S2
Mol. Mass.:
329.342
SMILES:
OC(=O)CCN1C(=S)S\C(=C/c2ccc(F)cc2F)C1=O
: