Target
Peroxisome proliferator-activated receptor gamma
Ligand
BDBM79447
Substrate
Meas. Tech.
Luminescence-based cell-based assay provider high throughput dose response assay for partial agonists of the peroxisome proliferator-activated receptor gamma (PPARg)
EC50
3000±n/a nM
Citation
 PubChem, PC Luminescence-based cell-based assay provider high throughput dose response assay for partial agonists of the peroxisome proliferator-activated receptor gamma (PPARg) PubChem Bioassay (2011)[AID] 
Target
Name:
Peroxisome proliferator-activated receptor gamma
Synonyms:
NR1C3 PPAR-gamma PPARG_HUMAN Peroxisome proliferator-activated receptor gamma (PPAR gamma) Peroxisome proliferator-activated receptor gamma (PPARĪ³) peroxisome proliferator-activated receptor gamma isoform 2
Type:
Nuclear Receptor
Mol. Mass.:
57613.46
Organism:
Homo sapiens (Human)
Description:
P37231
Residue:
505
  
Inhibitor
Name:
BDBM79447
Synonyms:
3-[(5Z)-5-[3-(4-fluorobenzyl)oxybenzylidene]-4-keto-2-thioxo-thiazolidin-3-yl]propionic acid 3-[(5Z)-5-[[3-[(4-fluorophenyl)methoxy]phenyl]methylidene]-4-oxo-2-sulfanylidene-1,3-thiazolidin-3-yl]propanoic acid SR-03000001968 cid_44807133
Type:
Small organic molecule
Emp. Form.:
C20H16FNO4S2
Mol. Mass.:
417.474
SMILES:
OC(=O)CCN1C(=S)S\C(=C/c2cccc(OCc3ccc(F)cc3)c2)C1=O
: