Target
Epidermal growth factor receptor
Ligand
BDBM270597
Substrate
Meas. Tech.
High Throughput EGFR Biochemical Assay
pH
7±n/a
Temperature
298.15±n/a K
IC50
19.0±n/a nM
Comments
extracted
Citation
 Balan, GChou, CKim, MKirschberg, TALink, JOPhillips, GSaito, RDSquires, NHTaylor, JGWatkins, WJWright, NE Cot modulators and methods of use thereof US Patent  US10059695 Publication Date 8/28/2018 
Target
Name:
Epidermal growth factor receptor
Synonyms:
EGF Receptor Substrate EGFR_HUMAN ERBB1 Epidermal Growth Factor Receptor erbB-1 Epidermal growth factor receptor (EGFR) HER1 Proto-oncogene c-ErbB-1 Tyrosine-Protein Kinase ErbB-1
Type:
Receptor Kinase Domain
Mol. Mass.:
134279.59
Organism:
Homo sapiens (Human)
Description:
P00533
Residue:
1210
  
Inhibitor
Name:
BDBM270597
Synonyms:
8-chloro-N4-(3- chloro-4- fluorophenyl)-N6- ((1-(1- ethylpiperidin-4-yl)- 1H-1,2,3-triazol-4- yl)(phenyl)methyl) quinazoline-4,6- diamine US10577352, Compound II-3
Type:
Small organic molecule
Emp. Form.:
C30H29Cl2FN8
Mol. Mass.:
591.509
SMILES:
CCN1CCC(CC1)n1cc(nn1)C(Nc1cc(Cl)c2ncnc(Nc3ccc(F)c(Cl)c3)c2c1)c1ccccc1
: