Target
Sphingosine 1-phosphate receptor 4
Ligand
BDBM79459
Substrate
Meas. Tech.
Late-stage fluorescence dose response cell-based assay to identify agonists of the Sphingosine 1-Phosphate Receptor 4 (S1P4): purchased compounds EC50
EC50
>50000±n/a nM
Citation
 PubChem, PC Late-stage fluorescence dose response cell-based assay to identify agonists of the Sphingosine 1-Phosphate Receptor 4 (S1P4): purchased compounds EC50 PubChem Bioassay (2011)[AID] 
Target
Name:
Sphingosine 1-phosphate receptor 4
Synonyms:
EDG6 S1P receptor 4 S1P4 S1PR4_HUMAN Sphingosine 1-phosphate receptor Edg-6 sphingosine-1-phosphate 4 S1P4
Type:
G Protein-Coupled Receptor (GPCR)
Mol. Mass.:
41647.39
Organism:
Homo sapiens (Human)
Description:
Residue:
384
  
Inhibitor
Name:
BDBM79459
Synonyms:
1-benzyl-5-chloro-3-methyl-pyrazole-4-carboxylic acid 1-cyanoethyl ester 1-cyanoethyl 5-chloranyl-3-methyl-1-(phenylmethyl)pyrazole-4-carboxylate SR-01000049760 cid_3550569
Type:
Small organic molecule
Emp. Form.:
C15H14ClN3O2
Mol. Mass.:
303.744
SMILES:
CC(OC(=O)c1c(C)nn(Cc2ccccc2)c1Cl)C#N
: