Target
Sphingosine 1-phosphate receptor 4
Ligand
BDBM79464
Substrate
Meas. Tech.
Late-stage fluorescence dose response cell-based assay to identify agonists of the Sphingosine 1-Phosphate Receptor 4 (S1P4): purchased compounds EC50
EC50
1500±n/a nM
Citation
 PubChem, PC Late-stage fluorescence dose response cell-based assay to identify agonists of the Sphingosine 1-Phosphate Receptor 4 (S1P4): purchased compounds EC50 PubChem Bioassay (2011)[AID] 
Target
Name:
Sphingosine 1-phosphate receptor 4
Synonyms:
EDG6 S1P receptor 4 S1P4 S1PR4_HUMAN Sphingosine 1-phosphate receptor Edg-6 sphingosine-1-phosphate 4 S1P4
Type:
G Protein-Coupled Receptor (GPCR)
Mol. Mass.:
41647.39
Organism:
Homo sapiens (Human)
Description:
Residue:
384
  
Inhibitor
Name:
BDBM79464
Synonyms:
5-chloro-1-(2-chlorobenzyl)-3-methyl-pyrazole-4-carboxylic acid [2-(ethylcarbamoylamino)-2-keto-1-methyl-ethyl] ester SR-01000713332 [1-(ethylcarbamoylamino)-1-oxidanylidene-propan-2-yl] 5-chloranyl-1-[(2-chlorophenyl)methyl]-3-methyl-pyrazole-4-carboxylate cid_3536865
Type:
Small organic molecule
Emp. Form.:
C18H20Cl2N4O4
Mol. Mass.:
427.282
SMILES:
CCNC(=O)NC(=O)C(C)OC(=O)c1c(C)nn(Cc2ccccc2Cl)c1Cl
: