Target
Sphingosine 1-phosphate receptor 4
Ligand
BDBM79486
Substrate
Meas. Tech.
Late-stage fluorescence dose response cell-based assay to identify agonists of the Sphingosine 1-Phosphate Receptor 4 (S1P4): purchased compounds EC50
EC50
>50000±n/a nM
Citation
 PubChem, PC Late-stage fluorescence dose response cell-based assay to identify agonists of the Sphingosine 1-Phosphate Receptor 4 (S1P4): purchased compounds EC50 PubChem Bioassay (2011)[AID] 
Target
Name:
Sphingosine 1-phosphate receptor 4
Synonyms:
EDG6 S1P receptor 4 S1P4 S1PR4_HUMAN Sphingosine 1-phosphate receptor Edg-6 sphingosine-1-phosphate 4 S1P4
Type:
G Protein-Coupled Receptor (GPCR)
Mol. Mass.:
41647.39
Organism:
Homo sapiens (Human)
Description:
Residue:
384
  
Inhibitor
Name:
BDBM79486
Synonyms:
3-[2-(3,5-dimethylphenoxy)ethoxy]-6-methyl-2-nitro-pyridine SR-02000000327 cid_18775975
Type:
Small organic molecule
Emp. Form.:
C16H18N2O4
Mol. Mass.:
302.3251
SMILES:
Cc1cc(C)cc(OCCOc2ccc(C)nc2[N+]([O-])=O)c1
: