Target
Beta-adrenergic receptor kinase 1
Ligand
BDBM31715
Substrate
Meas. Tech.
Dose Response of inhibitors of GRK2 binding with RNA aptamer, Cherry Pick 1
EC50
14790±n/a nM
Citation
 PubChem, PC Dose Response of inhibitors of GRK2 binding with RNA aptamer, Cherry Pick 1 PubChem Bioassay (2011)[AID] 
Target
Name:
Beta-adrenergic receptor kinase 1
Synonyms:
ADRBK1 BARK Beta-ARK-1 G-protein coupled receptor kinase 2 GRK2
Type:
Enzyme
Mol. Mass.:
79581.30
Organism:
Homo sapiens (Human)
Description:
P25098
Residue:
689
  
Inhibitor
Name:
BDBM31715
Synonyms:
3-[(4Z)-4-[(E)-3-(2-furanyl)prop-2-enylidene]-3-methyl-5-oxo-1-pyrazolyl]benzoic acid 3-[(4Z)-4-[(E)-3-(furan-2-yl)prop-2-enylidene]-3-methyl-5-oxidanylidene-pyrazol-1-yl]benzoic acid 3-{4-[3-(2-furyl)-2-propenylidene]-3-methyl-5-oxo-4,5-dihydro-1H-pyrazol-1-yl}benzoic acid SMR000113614 | cid_9549698
Type:
Small organic molecule
Emp. Form.:
C18H14N2O4
Mol. Mass.:
322.3148
SMILES:
OC(=O)c1cccc(c1)-n1[nH]c(=C)c(=CC=Cc2ccco2)c1=O
: