Target
Beta-adrenergic receptor kinase 1
Ligand
BDBM53121
Substrate
Meas. Tech.
Dose Response of inhibitors of GRK2 binding with RNA aptamer, Cherry Pick 1
EC50
7830±n/a nM
Citation
 PubChem, PC Dose Response of inhibitors of GRK2 binding with RNA aptamer, Cherry Pick 1 PubChem Bioassay (2011)[AID] 
Target
Name:
Beta-adrenergic receptor kinase 1
Synonyms:
ADRBK1 BARK Beta-ARK-1 G-protein coupled receptor kinase 2 GRK2
Type:
Enzyme
Mol. Mass.:
79581.30
Organism:
Homo sapiens (Human)
Description:
P25098
Residue:
689
  
Inhibitor
Name:
BDBM53121
Synonyms:
(5E)-5-(2-furanylmethylidene)-1-(4-methoxyphenyl)-2-sulfanylidene-1,3-diazinane-4,6-dione (5E)-5-(furan-2-ylmethylidene)-1-(4-methoxyphenyl)-2-sulfanylidene-1,3-diazinane-4,6-dione MLS001204507 cid_5757581
Type:
Small organic molecule
Emp. Form.:
C16H12N2O4S
Mol. Mass.:
328.342
SMILES:
COc1ccc(cc1)N1C(=S)NC(=O)C(=Cc2ccco2)C1=O
: