Target
Orexin/Hypocretin receptor type 1
Ligand
BDBM404286
Substrate
Meas. Tech.
FLIPR Ca2+ Flux Assay
IC50
>10000±n/a nM
Citation
 Liverton, NKuduk, SDBeshore, DLuo, YMeng, NYu, T Piperidine isoxazole and isothiazole orexin receptor antagonists US Patent  US10017504 Publication Date 7/10/2018 
Target
Name:
Orexin/Hypocretin receptor type 1
Synonyms:
HCRTR1 OX1R_HUMAN Orexin receptor type 1 (OR 1) Orexin receptor type 1 (OX1) Orexin receptor type 1 (OxR1) | Ox1r
Type:
Protein
Mol. Mass.:
47554.50
Organism:
Homo sapiens (Human)
Description:
O43613
Residue:
425
  
Inhibitor
Name:
BDBM404286
Synonyms:
(2-{5-[(3R,6R)-6-Methyl-1-{[2-(2H-1,2,3-triazol-2-yl)phenyl]carbonyl}piperidin-3-yl]isoxazol-3-yl}propan-2-ol) | US10017504, 20
Type:
Small organic molecule
Emp. Form.:
C21H23N5O4
Mol. Mass.:
409.4384
SMILES:
CCOC(=O)c1cc(on1)[C@@H]1CC[C@@H](C)N(C1)C(=O)c1ccccc1-n1nccn1
: