Target
Mitochondrial import inner membrane translocase subunit TIM23
Ligand
BDBM11297
Substrate
Meas. Tech.
Dose Response confirmation of uHTS small molecule inhibitors of tim10-1: a luminescent tim23-1 yeast counterscreen.
IC50
2080±n/a nM
Citation
 PubChem, PC Dose Response confirmation of uHTS small molecule inhibitors of tim10-1: a luminescent tim23-1 yeast counterscreen. PubChem Bioassay (2011)[AID] 
Target
Name:
Mitochondrial import inner membrane translocase subunit TIM23
Synonyms:
MAS6 MPI3 TIM23_YEAST | TPA: Essential component of the Translocase of the Inner Mitochondrial membrane (TIM23 complex)
Type:
Enzyme Catalytic Domain
Mol. Mass.:
23245.32
Organism:
Saccharomyces cerevisiae S288c
Description:
gi_285814664
Residue:
222
  
Inhibitor
Name:
BDBM11297
Synonyms:
4,6-dimethyl-2-[(4-methylbenzene)sulfonyl]-5-nitropyridine-3-carbonitrile acs.jmedchem.1c00409_ST.544 | cid_2726176
Type:
Small organic molecule
Emp. Form.:
C15H13N3O4S
Mol. Mass.:
331.346
SMILES:
Cc1ccc(cc1)S(=O)(=O)c1nc(C)c(c(C)c1C#N)[N+]([O-])=O
: