Target
Neurotensin receptor type 1
Ligand
BDBM54202
Substrate
Meas. Tech.
Dose Response confirmation of Image-Based HTS for Selective Agonists for NTR1
EC50
10200±n/a nM
Citation
 PubChem, PC Dose Response confirmation of Image-Based HTS for Selective Agonists for NTR1 PubChem Bioassay (2011)[AID] 
Target
Name:
Neurotensin receptor type 1
Synonyms:
Dopamine receptor D2L/neurotensin receptor NTS1 NTRR Neurotensin receptor 1 | neurotensin receptor type 1
Type:
PROTEIN
Mol. Mass.:
46278.89
Organism:
Homo sapiens (Human)
Description:
ChEMBL_1453811
Residue:
418
  
Inhibitor
Name:
BDBM54202
Synonyms:
2-ethyl-3-methyl-4-quinolinecarboxylic acid [2-[3-(4-morpholinylsulfonyl)anilino]-2-oxoethyl] ester MLS000565080 [2-(3-morpholin-4-ylsulfonylanilino)-2-oxoethyl] 2-ethyl-3-methylquinoline-4-carboxylate cid_3357104
Type:
Small organic molecule
Emp. Form.:
C25H27N3O6S
Mol. Mass.:
497.563
SMILES:
CCc1nc2ccccc2c(C(=O)OCC(=O)Nc2cccc(c2)S(=O)(=O)N2CCOCC2)c1C
: