Target
Neurotensin receptor type 1
Ligand
BDBM57256
Substrate
Meas. Tech.
Dose Response confirmation of Image-Based HTS for Selective Agonists for NTR1
EC50
12100±n/a nM
Citation
 PubChem, PC Dose Response confirmation of Image-Based HTS for Selective Agonists for NTR1 PubChem Bioassay (2011)[AID] 
Target
Name:
Neurotensin receptor type 1
Synonyms:
Dopamine receptor D2L/neurotensin receptor NTS1 NTRR Neurotensin receptor 1 | neurotensin receptor type 1
Type:
PROTEIN
Mol. Mass.:
46278.89
Organism:
Homo sapiens (Human)
Description:
ChEMBL_1453811
Residue:
418
  
Inhibitor
Name:
BDBM57256
Synonyms:
(5E)-1-methyl-5-[(1-naphthalen-2-ylpyrrol-2-yl)methylidene]-2-sulfanylidene-1,3-diazinane-4,6-dione (5E)-1-methyl-5-[[1-(2-naphthyl)pyrrol-2-yl]methylene]-2-thioxo-hexahydropyrimidine-4,6-quinone SMR000154286 | cid_7341556
Type:
Small organic molecule
Emp. Form.:
C20H15N3O2S
Mol. Mass.:
361.417
SMILES:
CN1C(=S)NC(=O)\C(=C/c2cccn2-c2ccc3ccccc3c2)C1=O
: