Target
Neurotensin receptor type 1
Ligand
BDBM39763
Substrate
Meas. Tech.
Dose Response confirmation of Image-Based HTS for Selective Agonists for NTR1
EC50
18300±n/a nM
Citation
 PubChem, PC Dose Response confirmation of Image-Based HTS for Selective Agonists for NTR1 PubChem Bioassay (2011)[AID] 
Target
Name:
Neurotensin receptor type 1
Synonyms:
Dopamine receptor D2L/neurotensin receptor NTS1 NTRR Neurotensin receptor 1 | neurotensin receptor type 1
Type:
PROTEIN
Mol. Mass.:
46278.89
Organism:
Homo sapiens (Human)
Description:
ChEMBL_1453811
Residue:
418
  
Inhibitor
Name:
BDBM39763
Synonyms:
2-[(E)-2-(2-hydroxyphenyl)ethenyl]-1,3,3-trimethyl-5-indol-1-iumcarboxylic acid methyl ester;iodide MLS000521446 cid_11957214 methyl 2-[(E)-2-(2-hydroxyphenyl)ethenyl]-1,3,3-trimethylindol-1-ium-5-carboxylate;iodide
Type:
Small organic molecule
Emp. Form.:
C21H22NO3
Mol. Mass.:
336.4037
SMILES:
COC(=O)c1ccc2c(c1)C(C)(C)C(\C=C\c1ccccc1O)=[N+]2C
: