Target
Neurotensin receptor type 1
Ligand
BDBM79533
Substrate
Meas. Tech.
Dose Response confirmation of Image-Based HTS for Selective Agonists for NTR1
EC50
9060±n/a nM
Citation
 PubChem, PC Dose Response confirmation of Image-Based HTS for Selective Agonists for NTR1 PubChem Bioassay (2011)[AID] 
Target
Name:
Neurotensin receptor type 1
Synonyms:
Dopamine receptor D2L/neurotensin receptor NTS1 NTRR Neurotensin receptor 1 | neurotensin receptor type 1
Type:
PROTEIN
Mol. Mass.:
46278.89
Organism:
Homo sapiens (Human)
Description:
ChEMBL_1453811
Residue:
418
  
Inhibitor
Name:
BDBM79533
Synonyms:
(5E)-5-[[1-(4-chlorophenyl)-2-pyrrolyl]methylidene]-1-(3-methylphenyl)-1,3-diazinane-2,4,6-trione (5E)-5-[[1-(4-chlorophenyl)pyrrol-2-yl]methylidene]-1-(3-methylphenyl)-1,3-diazinane-2,4,6-trione MLS000573426 cid_2281759
Type:
Small organic molecule
Emp. Form.:
C22H16ClN3O3
Mol. Mass.:
405.834
SMILES:
Cc1cccc(c1)N1C(=O)NC(=O)C(=Cc2cccn2-c2ccc(Cl)cc2)C1=O
: