Target
Neurotensin receptor type 1
Ligand
BDBM68163
Substrate
Meas. Tech.
Dose Response confirmation of Image-Based HTS for Selective Agonists for NTR1
EC50
15200±n/a nM
Citation
 PubChem, PC Dose Response confirmation of Image-Based HTS for Selective Agonists for NTR1 PubChem Bioassay (2011)[AID] 
Target
Name:
Neurotensin receptor type 1
Synonyms:
Dopamine receptor D2L/neurotensin receptor NTS1 NTRR Neurotensin receptor 1 | neurotensin receptor type 1
Type:
PROTEIN
Mol. Mass.:
46278.89
Organism:
Homo sapiens (Human)
Description:
ChEMBL_1453811
Residue:
418
  
Inhibitor
Name:
BDBM68163
Synonyms:
2-[[2-(2,4-dichlorophenyl)-2-(1H-indol-3-yl)ethyl]amino]-1-phenyl-ethanol MLS001033995 cid_3947745
Type:
Small organic molecule
Emp. Form.:
C24H22Cl2N2O
Mol. Mass.:
425.35
SMILES:
OC(CNCC(c1c[nH]c2ccccc12)c1ccc(Cl)cc1Cl)c1ccccc1
: