Target
Integrin alpha-L
Ligand
BDBM79611
Substrate
Meas. Tech.
Dose Response of Developing T Cell Immune Modulators with powder sourced compounds
EC50
1213±n/a nM
Citation
 PubChem, PC Dose Response of Developing T Cell Immune Modulators with powder sourced compounds PubChem Bioassay (2011)[AID] 
Target
Name:
Integrin alpha-L
Synonyms:
CD11 antigen-like family member A Itgal Leukocyte function-associated molecule 1 alpha chain Ly-15 | Lymphocyte antigen 15
Type:
Enzyme Catalytic Domain
Mol. Mass.:
128317.79
Organism:
Mus musculus
Description:
P24063
Residue:
1163
  
Inhibitor
Name:
BDBM79611
Synonyms:
3-bromo-1-adamantanecarboxylic acid [2-[3-(4-morpholinylsulfonyl)anilino]-2-oxoethyl] ester VU0424146-1 [2-[(3-morpholin-4-ylsulfonylphenyl)amino]-2-oxidanylidene-ethyl] 3-bromanyladamantane-1-carboxylate | cid_5146117
Type:
Small organic molecule
Emp. Form.:
C23H29BrN2O6S
Mol. Mass.:
541.455
SMILES:
[H]C12CC3([H])CC(Br)(C1)CC(C2)(C3)C(=O)OCC(=O)Nc1cccc(c1)S(=O)(=O)N1CCOCC1
: