Target
Protein Mdm4
Ligand
BDBM72275
Substrate
Meas. Tech.
Dose Response confirmation of Inhibitors of Mdm2/MdmX interaction in luminescent format
IC50
3280±n/a nM
Citation
 PubChem, PC Dose Response confirmation of Inhibitors of Mdm2/MdmX interaction in luminescent format PubChem Bioassay (2011)[AID] 
Target
Name:
Protein Mdm4
Synonyms:
Double minute 4 protein MDM2-MDMX MDM4_HUMAN Mdm2-like p53-binding protein Protein Mdmx p53-binding protein | p53-binding protein Mdm4
Type:
Oncoprotein
Mol. Mass.:
54842.04
Organism:
Homo sapiens (Human)
Description:
The HDMX(1-188) were expressed in Escherichia coli BL21 (DE3) as a GST fusion and purified on glutathione sepharose.
Residue:
490
  
Inhibitor
Name:
BDBM72275
Synonyms:
(E)-2-butenedioic acid O4-[2-[(diphenylmethyl)amino]-2-oxoethyl] ester O1-ethyl ester 4-O-[2-(benzhydrylamino)-2-oxoethyl] 1-O-ethyl (E)-but-2-enedioate O4-[2-[(diphenylmethyl)amino]-2-oxidanylidene-ethyl] O1-ethyl (E)-but-2-enedioate cid_5889878
Type:
Small organic molecule
Emp. Form.:
C21H21NO5
Mol. Mass.:
367.3951
SMILES:
CCOC(=O)\C=C\C(=O)OCC(=O)NC(c1ccccc1)c1ccccc1
: