Target
Mitochondrial import inner membrane translocase subunit TIM10
Ligand
BDBM77672
Substrate
Meas. Tech.
Dose Response confirmation of uHTS small molecule inhibitors of tim23-1: a luminescent tim10-1 yeast counterscreen.
IC50
>100000±n/a nM
Citation
 PubChem, PC Dose Response confirmation of uHTS small molecule inhibitors of tim23-1: a luminescent tim10-1 yeast counterscreen. PubChem Bioassay (2011)[AID] 
Target
Name:
Mitochondrial import inner membrane translocase subunit TIM10
Synonyms:
MRS11 TIM10_YEAST TPA: Essential protein of the mitochondrial intermembrane space, forms a complex with Tim9p (TIM10 complex) that delivers hydrophobic proteins to the TIM22 complex for insertion into the inner ...
Type:
Enzyme Catalytic Domain
Mol. Mass.:
10303.50
Organism:
Saccharomyces cerevisiae S288c
Description:
gi_285809906
Residue:
93
  
Inhibitor
Name:
BDBM77672
Synonyms:
MLS000102881 N-(4-tert-butyl-1,3-thiazol-2-yl)-5-chlorothiophene-2-carboxamide N-(4-tert-butylthiazol-2-yl)-5-chloro-thiophene-2-carboxamide cid_1247280
Type:
Small organic molecule
Emp. Form.:
C12H13ClN2OS2
Mol. Mass.:
300.827
SMILES:
CC(C)(C)c1csc(NC(=O)c2ccc(Cl)s2)n1
: