Target
Mitochondrial import inner membrane translocase subunit TIM10
Ligand
BDBM26682
Substrate
Meas. Tech.
Dose Response confirmation of uHTS small molecule inhibitors of tim23-1: a luminescent tim10-1 yeast counterscreen.
IC50
>100000±n/a nM
Citation
 PubChem, PC Dose Response confirmation of uHTS small molecule inhibitors of tim23-1: a luminescent tim10-1 yeast counterscreen. PubChem Bioassay (2011)[AID] 
Target
Name:
Mitochondrial import inner membrane translocase subunit TIM10
Synonyms:
MRS11 TIM10_YEAST TPA: Essential protein of the mitochondrial intermembrane space, forms a complex with Tim9p (TIM10 complex) that delivers hydrophobic proteins to the TIM22 complex for insertion into the inner ...
Type:
Enzyme Catalytic Domain
Mol. Mass.:
10303.50
Organism:
Saccharomyces cerevisiae S288c
Description:
gi_285809906
Residue:
93
  
Inhibitor
Name:
BDBM26682
Synonyms:
2-amino-6-(4-hydroxyphenyl)-4-phenylpyridine-3-carbonitrile 2-aminopyridine-3-carbonitrile, 10
Type:
Small organic molecule
Emp. Form.:
C18H13N3O
Mol. Mass.:
287.3153
SMILES:
Nc1nc(cc(-c2ccccc2)c1C#N)-c1ccc(O)cc1
: