Target
Tyrosine-protein kinase JAK1
Ligand
BDBM270625
Substrate
Meas. Tech.
Jak Biochemical HTRF Assay Protocol
Temperature
298.15±n/a K
IC50
120±n/a nM
Comments
extracted
Citation
 Dinsmore, CFuller, PGuerin, DKatz, JDThompson, CFFalcone, DDeng, WTorres, LZeng, HBai, YFu, JKong, NLiu, YZheng, ZScott, ME Acyclic cyanoethylpyrazolo pyridones as janus kinase inhibitors US Patent  US10059705 Publication Date 8/28/2018 
Target
Name:
Tyrosine-protein kinase JAK1
Synonyms:
JAK-1 JAK1A JAK1_HUMAN Janus kinase 1 (JAK1) | Janus kinase 1 JAK1
Type:
Protein
Mol. Mass.:
133293.73
Organism:
Homo sapiens (Human)
Description:
P23458
Residue:
1154
  
Inhibitor
Name:
BDBM270625
Synonyms:
US10059705, II-20 | US10059705, II-21
Type:
Small organic molecule
Emp. Form.:
C22H20F3N5O2
Mol. Mass.:
443.4217
SMILES:
OC1(CCc2cc(Nc3nn([C@@H](CC#N)C4CC4)c4cc[nH]c(=O)c34)ccc12)C(F)(F)F
: