Target
Tyrosine-protein kinase JAK1
Ligand
BDBM270767
Substrate
Meas. Tech.
Jak Biochemical HTRF Assay Protocol
Temperature
298.15±n/a K
IC50
140±n/a nM
Comments
extracted
Citation
 Dinsmore, CFuller, PGuerin, DKatz, JDThompson, CFFalcone, DDeng, WTorres, LZeng, HBai, YFu, JKong, NLiu, YZheng, ZScott, ME Acyclic cyanoethylpyrazolo pyridones as janus kinase inhibitors US Patent  US10059705 Publication Date 8/28/2018 
Target
Name:
Tyrosine-protein kinase JAK1
Synonyms:
JAK-1 JAK1A JAK1_HUMAN Janus kinase 1 (JAK1) | Janus kinase 1 JAK1
Type:
Protein
Mol. Mass.:
133293.73
Organism:
Homo sapiens (Human)
Description:
P23458
Residue:
1154
  
Inhibitor
Name:
BDBM270767
Synonyms:
US10059705, II-162 | US10059705, II-163
Type:
Small organic molecule
Emp. Form.:
C23H23F3N6O
Mol. Mass.:
456.4635
SMILES:
FC(F)(F)C1(CCCN1)c1ccc(Nc2nn([C@@H](CC#N)C3CC3)c3cc[nH]c(=O)c23)cc1
: