Target
BRCA1-associated RING domain protein 1
Ligand
BDBM48124
Substrate
Meas. Tech.
Dose Response confirmation of Inhibitors of Mdm2/MdmX interaction using a Brca1/Bard1 BiLC Counterscreen assay
IC50
5590±n/a nM
Citation
 PubChem, PC Dose Response confirmation of Inhibitors of Mdm2/MdmX interaction using a Brca1/Bard1 BiLC Counterscreen assay PubChem Bioassay (2011)[AID] 
Target
Name:
BRCA1-associated RING domain protein 1
Synonyms:
BARD-1 BARD1_HUMAN
Type:
Enzyme Catalytic Domain
Mol. Mass.:
86678.08
Organism:
Homo sapiens (Human)
Description:
gi_116241265
Residue:
777
  
Inhibitor
Name:
BDBM48124
Synonyms:
(4,8-dimethylquinazolin-2-yl)-[3-(3-morpholinopropyl)-2,4-dihydro-1H-s-triazin-6-yl]amine 4,8-dimethyl-N-[3-[3-(4-morpholinyl)propyl]-2,4-dihydro-1H-1,3,5-triazin-6-yl]-2-quinazolinamine SMR000047283 | cid_666009
Type:
Small organic molecule
Emp. Form.:
C20H29N7O
Mol. Mass.:
383.4906
SMILES:
Cc1cccc2c(C)nc(NC3=NCN(CCCN4CCOCC4)CN3)nc12
: