Target
BRCA1-associated RING domain protein 1
Ligand
BDBM79630
Substrate
Meas. Tech.
Dose Response confirmation of Inhibitors of Mdm2/MdmX interaction using a Brca1/Bard1 BiLC Counterscreen assay
IC50
13400±n/a nM
Citation
 PubChem, PC Dose Response confirmation of Inhibitors of Mdm2/MdmX interaction using a Brca1/Bard1 BiLC Counterscreen assay PubChem Bioassay (2011)[AID] 
Target
Name:
BRCA1-associated RING domain protein 1
Synonyms:
BARD-1 BARD1_HUMAN
Type:
Enzyme Catalytic Domain
Mol. Mass.:
86678.08
Organism:
Homo sapiens (Human)
Description:
gi_116241265
Residue:
777
  
Inhibitor
Name:
BDBM79630
Synonyms:
MLS000049666 N-[4-[5-(3,4,5-trimethoxyphenyl)-1,2,4-oxadiazol-3-yl]phenyl]-piperonylamide SMR000076279 | cid_2203454
Type:
Small organic molecule
Emp. Form.:
C25H21N3O7
Mol. Mass.:
475.4501
SMILES:
COc1cc(cc(OC)c1OC)-c1nc(no1)-c1ccc(NC(=O)c2ccc3OCOc3c2)cc1
: