Target
BRCA1-associated RING domain protein 1
Ligand
BDBM63209
Substrate
Meas. Tech.
Dose Response confirmation of Inhibitors of Mdm2/MdmX interaction using a Brca1/Bard1 BiLC Counterscreen assay
IC50
3.53±n/a nM
Citation
 PubChem, PC Dose Response confirmation of Inhibitors of Mdm2/MdmX interaction using a Brca1/Bard1 BiLC Counterscreen assay PubChem Bioassay (2011)[AID] 
Target
Name:
BRCA1-associated RING domain protein 1
Synonyms:
BARD-1 BARD1_HUMAN
Type:
Enzyme Catalytic Domain
Mol. Mass.:
86678.08
Organism:
Homo sapiens (Human)
Description:
gi_116241265
Residue:
777
  
Inhibitor
Name:
BDBM63209
Synonyms:
3-(1-phenyl-2-thioxo-2,3-dihydro-1H-imidazol-4-yl)-2H-chromen-2-one 3-(3-phenyl-2-sulfanylidene-1H-imidazol-5-yl)-1-benzopyran-2-one CHEMBL1352521 SMR000206694 | cid_3380837
Type:
Small organic molecule
Emp. Form.:
C18H12N2O2S
Mol. Mass.:
320.365
SMILES:
O=c1oc2ccccc2cc1-c1cn(-c2ccccc2)c(=S)[nH]1
: