Target
Mitochondrial import inner membrane translocase subunit TIM10
Ligand
BDBM77014
Substrate
Meas. Tech.
Dose Response confirmation of uHTS small molecule inhibitors of tim23-1: a luminescent TIM10 yeast counterscreen.
IC50
49300±n/a nM
Citation
 PubChem, PC Dose Response confirmation of uHTS small molecule inhibitors of tim23-1: a luminescent TIM10 yeast counterscreen. PubChem Bioassay (2011)[AID] 
Target
Name:
Mitochondrial import inner membrane translocase subunit TIM10
Synonyms:
MRS11 TIM10_YEAST TPA: Essential protein of the mitochondrial intermembrane space, forms a complex with Tim9p (TIM10 complex) that delivers hydrophobic proteins to the TIM22 complex for insertion into the inner ...
Type:
Enzyme Catalytic Domain
Mol. Mass.:
10303.50
Organism:
Saccharomyces cerevisiae S288c
Description:
gi_285809906
Residue:
93
  
Inhibitor
Name:
BDBM77014
Synonyms:
MLS000088012 N-(1,3-benzothiazol-2-yl)-1-(4-chlorophenyl)sulfonyl-pyrrolidine-2-carboxamide N-1,3-benzothiazol-2-yl-1-[(4-chlorophenyl)sulfonyl]prolinamide cid_2936947
Type:
Small organic molecule
Emp. Form.:
C18H16ClN3O3S2
Mol. Mass.:
421.921
SMILES:
Clc1ccc(cc1)S(=O)(=O)N1CCCC1C(=O)Nc1nc2ccccc2s1
: