Target
Tropomyosin alpha-1 chain
Ligand
BDBM50774
Substrate
Meas. Tech.
Fluorescence-based biochemical high throughput dose response assay for activators of the calcium sensitivity of cardiac Regulated Thin Filaments (RTF)
EC50
9003±n/a nM
Citation
 PubChem, PC Fluorescence-based biochemical high throughput dose response assay for activators of the calcium sensitivity of cardiac Regulated Thin Filaments (RTF) PubChem Bioassay (2011)[AID] 
Target
Name:
Tropomyosin alpha-1 chain
Synonyms:
TPM1 cardiac alpha tropomyosin
Type:
Enzyme Catalytic Domain
Mol. Mass.:
32681.01
Organism:
Sus scrofa
Description:
P42639
Residue:
284
  
Inhibitor
Name:
BDBM50774
Synonyms:
6-amino-1',2-dimethyl-spiro[3,8a-dihydro-1H-isoquinoline-8,4'-piperidine]-5,7,7-tricarbonitrile;hydroxide;hydrate 6-azanyl-1',2-dimethyl-spiro[3,8a-dihydro-1H-isoquinoline-8,4'-piperidine]-5,7,7-tricarbonitrile;hydroxide;hydrate SMR000057533 | cid_657423
Type:
Small organic molecule
Emp. Form.:
C18H22N6
Mol. Mass.:
322.4075
SMILES:
CN1CCC2(CC1)C1CN(C)CCC1=C(C#N)C(=N)C2(C#N)C#N
: