Target
Tropomyosin alpha-1 chain
Ligand
BDBM44437
Substrate
Meas. Tech.
Fluorescence-based biochemical high throughput dose response assay for activators of the calcium sensitivity of cardiac Regulated Thin Filaments (RTF)
EC50
5547±n/a nM
Citation
 PubChem, PC Fluorescence-based biochemical high throughput dose response assay for activators of the calcium sensitivity of cardiac Regulated Thin Filaments (RTF) PubChem Bioassay (2011)[AID] 
Target
Name:
Tropomyosin alpha-1 chain
Synonyms:
TPM1 cardiac alpha tropomyosin
Type:
Enzyme Catalytic Domain
Mol. Mass.:
32681.01
Organism:
Sus scrofa
Description:
P42639
Residue:
284
  
Inhibitor
Name:
BDBM44437
Synonyms:
1-ethyl-3-phenyl-pyrazolo[4,3-b]quinoxaline MLS000041625 cid_665240
Type:
Small organic molecule
Emp. Form.:
C17H14N4
Mol. Mass.:
274.3199
SMILES:
CCn1nc(-c2ccccc2)c2nc3ccccc3nc12
: