Target
Tropomyosin alpha-1 chain
Ligand
BDBM47599
Substrate
Meas. Tech.
Fluorescence-based biochemical high throughput dose response assay for activators of the calcium sensitivity of cardiac Regulated Thin Filaments (RTF)
EC50
396.99±n/a nM
Citation
 PubChem, PC Fluorescence-based biochemical high throughput dose response assay for activators of the calcium sensitivity of cardiac Regulated Thin Filaments (RTF) PubChem Bioassay (2011)[AID] 
Target
Name:
Tropomyosin alpha-1 chain
Synonyms:
TPM1 cardiac alpha tropomyosin
Type:
Enzyme Catalytic Domain
Mol. Mass.:
32681.01
Organism:
Sus scrofa
Description:
P42639
Residue:
284
  
Inhibitor
Name:
BDBM47599
Synonyms:
3-(2-furanyl)-5-[(E)-2-(4-nitrophenyl)ethenyl]-2-phenyl-3,4-dihydropyrazole 5-(2-furyl)-3-(2-{4-nitrophenyl}vinyl)-1-phenyl-4,5-dihydro-1H-pyrazole MLS000701082 cid_15945043
Type:
Small organic molecule
Emp. Form.:
C21H17N3O3
Mol. Mass.:
359.378
SMILES:
[O-][N+](=O)c1ccc(C=C[C-]2CC(c3ccco3)[N+](=N2)c2ccccc2)cc1
: