Target
Tropomyosin alpha-1 chain
Ligand
BDBM79760
Substrate
Meas. Tech.
Fluorescence-based biochemical high throughput dose response assay for activators of the calcium sensitivity of cardiac Regulated Thin Filaments (RTF)
EC50
852.88±n/a nM
Citation
 PubChem, PC Fluorescence-based biochemical high throughput dose response assay for activators of the calcium sensitivity of cardiac Regulated Thin Filaments (RTF) PubChem Bioassay (2011)[AID] 
Target
Name:
Tropomyosin alpha-1 chain
Synonyms:
TPM1 cardiac alpha tropomyosin
Type:
Enzyme Catalytic Domain
Mol. Mass.:
32681.01
Organism:
Sus scrofa
Description:
P42639
Residue:
284
  
Inhibitor
Name:
BDBM79760
Synonyms:
3-[2-[(E)-2-[(Z)-(5-methoxy-3-methyl-1,3-benzoxazol-2-ylidene)methyl]but-1-enyl]-1,3-benzothiazol-3-ium-3-yl]-1-propanesulfonate MLS001210347 The compound has not trivial name. | cid_5717927
Type:
Small organic molecule
Emp. Form.:
C24H26N2O5S2
Mol. Mass.:
486.604
SMILES:
CC\C(=C/c1sc2ccccc2[n+]1CCCS([O-])(=O)=O)\C=C1/Oc2ccc(OC)cc2N1C
: