Target
Orexin/Hypocretin receptor type 1
Ligand
BDBM75438
Substrate
Meas. Tech.
Fluorescence-based cell-based high throughput dose response assay for antagonists of the orexin 1 receptor (OX1R; HCRTR1)
IC50
15785±n/a nM
Citation
 PubChem, PC Fluorescence-based cell-based high throughput dose response assay for antagonists of the orexin 1 receptor (OX1R; HCRTR1) PubChem Bioassay (2011)[AID] 
Target
Name:
Orexin/Hypocretin receptor type 1
Synonyms:
HCRTR1 OX1R_HUMAN Orexin receptor type 1 (OR 1) Orexin receptor type 1 (OX1) Orexin receptor type 1 (OxR1) | Ox1r
Type:
Protein
Mol. Mass.:
47554.50
Organism:
Homo sapiens (Human)
Description:
O43613
Residue:
425
  
Inhibitor
Name:
BDBM75438
Synonyms:
2-[4-[5-methoxy-2-(3-methoxyphenyl)-1-benzothiophen-3-yl]phenoxy]-N,N-dimethyl-ethanamine 2-[4-[5-methoxy-2-(3-methoxyphenyl)benzothiophen-3-yl]phenoxy]ethyl-dimethyl-amine SMR001397780 | cid_44202257
Type:
Small organic molecule
Emp. Form.:
C26H27NO3S
Mol. Mass.:
433.562
SMILES:
COc1cccc(c1)-c1sc2ccc(OC)cc2c1-c1ccc(OCCN(C)C)cc1
: