Target
Orexin/Hypocretin receptor type 1
Ligand
BDBM47383
Substrate
Meas. Tech.
Homogeneous Time Resolved Fluorescence (HTRF)-based cell-based high throughput dose response assay for antagonists of the orexin 1 receptor (OX1R; HCRTR1)
IC50
183.85±n/a nM
Citation
 PubChem, PC Homogeneous Time Resolved Fluorescence (HTRF)-based cell-based high throughput dose response assay for antagonists of the orexin 1 receptor (OX1R; HCRTR1) PubChem Bioassay (2011)[AID] 
Target
Name:
Orexin/Hypocretin receptor type 1
Synonyms:
HCRTR1 OX1R_HUMAN Orexin receptor type 1 (OR 1) Orexin receptor type 1 (OX1) Orexin receptor type 1 (OxR1) | Ox1r
Type:
Protein
Mol. Mass.:
47554.50
Organism:
Homo sapiens (Human)
Description:
O43613
Residue:
425
  
Inhibitor
Name:
BDBM47383
Synonyms:
N-[2-[diethylamino-[3-(trifluoromethyl)anilino]phosphoryl]-5-(dimethylamino)phenyl]-2-furamide N-[2-[diethylamino-[3-(trifluoromethyl)anilino]phosphoryl]-5-(dimethylamino)phenyl]furan-2-carboxamide UNM000011097501 | cid_2320415
Type:
Small organic molecule
Emp. Form.:
C24H28F3N4O3P
Mol. Mass.:
508.4731
SMILES:
CCN(CC)P(=O)(Nc1cccc(c1)C(F)(F)F)c1ccc(cc1NC(=O)c1ccco1)N(C)C
: