Target
Beta-galactosidase
Ligand
BDBM79969
Substrate
Meas. Tech.
HTS Dose response counterscreen for assays utilizing the enzyme, beta-galactosidase - Set 3
IC50
>66600±0 nM
Citation
 PubChem, PC HTS Dose response counterscreen for assays utilizing the enzyme, beta-galactosidase - Set 3 PubChem Bioassay (2011)[AID] 
Target
Name:
Beta-galactosidase
Synonyms:
BGAL_ECOLX Lactase | lacZ
Type:
PROTEIN
Mol. Mass.:
116943.87
Organism:
Escherichia coli
Description:
ChEMBL_215882
Residue:
1029
  
Inhibitor
Name:
BDBM79969
Synonyms:
3-[[(2Z)-2-(6-ketocyclohexa-2,4-dien-1-ylidene)-3H-1,3,4-oxadiazol-5-yl]thio]-1-phenyl-pyrrolidine-2,5-quinone 3-[[(2Z)-2-(6-oxo-1-cyclohexa-2,4-dienylidene)-3H-1,3,4-oxadiazol-5-yl]thio]-1-phenylpyrrolidine-2,5-dione 3-{[5-(2-hydroxyphenyl)-1,3,4-oxadiazol-2-yl]thio}-1-phenyl-2,5-pyrrolidinedione SMR000078558 | cid_5740381
Type:
Small organic molecule
Emp. Form.:
C18H13N3O4S
Mol. Mass.:
367.379
SMILES:
Oc1cc(Sc2nnc(o2)-c2ccccc2O)c(O)n1-c1ccccc1
: