Target
Beta-galactosidase
Ligand
BDBM37827
Substrate
Meas. Tech.
HTS Dose response counterscreen for assays utilizing the enzyme, beta-galactosidase - Set 3
IC50
>66600±0 nM
Citation
 PubChem, PC HTS Dose response counterscreen for assays utilizing the enzyme, beta-galactosidase - Set 3 PubChem Bioassay (2011)[AID] 
Target
Name:
Beta-galactosidase
Synonyms:
BGAL_ECOLX Lactase | lacZ
Type:
PROTEIN
Mol. Mass.:
116943.87
Organism:
Escherichia coli
Description:
ChEMBL_215882
Residue:
1029
  
Inhibitor
Name:
BDBM37827
Synonyms:
2-methyl-5-(4-nitrophenyl)-3-phenyl-1H-pyrazolo[1,5-a]pyrimidin-7-one MLS000547439 cid_1051569
Type:
Small organic molecule
Emp. Form.:
C19H14N4O3
Mol. Mass.:
346.3395
SMILES:
Cc1[nH]n2c(nc(cc2=O)-c2ccc(cc2)[N+]([O-])=O)c1-c1ccccc1
: