Target
Beta-galactosidase
Ligand
BDBM54797
Substrate
Meas. Tech.
HTS Dose response counterscreen for assays utilizing the enzyme, beta-galactosidase - Set 3
IC50
>66600±0 nM
Citation
 PubChem, PC HTS Dose response counterscreen for assays utilizing the enzyme, beta-galactosidase - Set 3 PubChem Bioassay (2011)[AID] 
Target
Name:
Beta-galactosidase
Synonyms:
BGAL_ECOLX Lactase | lacZ
Type:
PROTEIN
Mol. Mass.:
116943.87
Organism:
Escherichia coli
Description:
ChEMBL_215882
Residue:
1029
  
Inhibitor
Name:
BDBM54797
Synonyms:
2-chloranyl-N-[2,2,2-tris(chloranyl)-1-[(4-methoxy-2-nitro-phenyl)carbamothioylamino]ethyl]benzamide 2-chloro-N-[2,2,2-trichloro-1-[(4-methoxy-2-nitro-phenyl)thiocarbamoylamino]ethyl]benzamide 2-chloro-N-[2,2,2-trichloro-1-[[(4-methoxy-2-nitroanilino)-sulfanylidenemethyl]amino]ethyl]benzamide SMR000137062 | cid_2830589
Type:
Small organic molecule
Emp. Form.:
C17H14Cl4N4O4S
Mol. Mass.:
512.194
SMILES:
COc1ccc(NC(=S)NC(NC(=O)c2ccccc2Cl)C(Cl)(Cl)Cl)c(c1)[N+]([O-])=O
: