Target
Beta-galactosidase
Ligand
BDBM29653
Substrate
Meas. Tech.
HTS Dose response counterscreen for assays utilizing the enzyme, beta-galactosidase - Set 3
IC50
>66600±0 nM
Citation
 PubChem, PC HTS Dose response counterscreen for assays utilizing the enzyme, beta-galactosidase - Set 3 PubChem Bioassay (2011)[AID] 
Target
Name:
Beta-galactosidase
Synonyms:
BGAL_ECOLX Lactase | lacZ
Type:
PROTEIN
Mol. Mass.:
116943.87
Organism:
Escherichia coli
Description:
ChEMBL_215882
Residue:
1029
  
Inhibitor
Name:
BDBM29653
Synonyms:
3-(4-chlorobenzyl)-1,4-diketo-naphthalene-2-carboxylic acid ethyl ester MLS000532056 cid_2841621 ethyl 3-[(4-chlorophenyl)methyl]-1,4-bis(oxidanylidene)naphthalene-2-carboxylate | ethyl 3-[(4-chlorophenyl)methyl]-1,4-dioxonaphthalene-2-carboxylate
Type:
Small organic molecule
Emp. Form.:
C20H15ClO4
Mol. Mass.:
354.784
SMILES:
CCOC(=O)C1=C(Cc2ccc(Cl)cc2)C(=O)c2ccccc2C1=O
: